{"text_format":"1","workbook":"xlsx","n_sheets":33,"sheets":["instructions","inputPrYr","inputOth","inputBudSum","cert","computation","mvalloc","transfer","TransferStatutes","debt-lease","Library Grant","gen","DebtSvs-Library","road","levypage9","levypage10","levypage11","nolevypage12","nonbud","NonBudFunds","summ","nhood","Resolution","Tab A","Tab B","Tab C","Tab D","Tab E","Mill Rate Computation","Helpful Links","legend","SignCert","Publication"],"not_rendered":{"charts":0,"images":3,"macros":0,"external_links":0,"defined_names":9,"comments":0,"pivot_tables":0},"unopened":[],"bounds":{"document_bytes":16777216,"sheet_cells":100000,"rows_first":2000,"rows_last":500,"rows_between":2000,"halvings":0,"cell_chars":16384,"cell_head_chars":4096},"cells_cut":0,"cells_raw":0,"read":"whole","date_system":"1900"}

{"sheet":"instructions","index":0,"n_rows":111,"n_cols":1,"rows_kept":111,"cut":false,"hidden":false,"merged":[]}
["Township Spreadsheet Instructions"]
[]
["Read these instructions carefully.  If after reviewing them you still have questions, call Municipal Services at 785-296-2311 or e-mail : armunis@da.ks.gov"]
[]
["Townships can use the township.xls,  township1.xls, township2 or township3.xls files.   You must choose a form that meets the needs for the number of funds.  If you don't need all the funds, just leave the pages blank and number the completed pages sequentially. "]
[]
["Township.xls spreadsheet has General Fund, Debt Service, Library, Road Bridge, 4 levy fund pages, 2 no levy fund pages, and one Non-Budgeted fund page which holds 5 non- budgeted funds. "]
[]
{"$rows_left_out":104}
{"sheet":"inputPrYr","index":1,"n_rows":61,"n_cols":8,"rows_kept":61,"cut":false,"hidden":false,"merged":[[39,3,40,3],[9,0,9,4],[6,6,11,7]]}
["Input sheet for Township budget form"]
["Enter Township Name followed by 'Township'",null,null,"Garden City Township"]
["Enter County Name followed by 'County\"",null,null,"Finney County"]
[]
["Enter year being budgeted (YYYY)",null,null,2013]
[]
["Enter the following information from the sources shown.  This information will be entered on the budget ",null,null,null,null,null,"Note: The below amounts are used to reflect actual taxes received due to delinquent taxes.  Put a percentage in the green box to compute the amount and link to the fund pages. This is not mandatory and can be left blank.            "]
["forms in the appropriate locations.  If any of the numbers are wrong, change them on this input sheet."]
{"$rows_left_out":54}
{"sheet":"inputOth","index":2,"n_rows":57,"n_cols":5,"rows_kept":57,"cut":false,"hidden":false,"merged":[[3,0,3,4],[15,0,15,1],[42,0,42,1],[43,2,43,4]]}
[{"$f":"inputPrYr!D2","v":"Garden City Township"},null,null,null,{"$f":"inputPrYr!D5","v":2013}]
[{"$f":"inputPrYr!D3","v":"Finney County"}]
[]
["Note:  All amounts are to be entered in as whole numbers only."]
[]
[{"$f":"CONCATENATE(\"From the County Clerks Budget Information for \",E1,\":\")","v":"From the County Clerks Budget Information for 2013:"}]
[{"$f":"CONCATENATE(\"Total Assessed Valuation for \",E1-1,\"\")","v":"Total Assessed Valuation for 2012"},null,null,null,83550962]
[{"$f":"CONCATENATE(\"New Improvements for \",E1-1,\"\")","v":"New Improvements for 2012"},null,null,null,601869]
{"$rows_left_out":50}
{"sheet":"inputBudSum","index":3,"n_rows":26,"n_cols":10,"rows_kept":26,"cut":false,"hidden":false,"merged":[[1,0,1,5],[17,0,17,1]]}
[null,null,null,null,null,null,null,null,null,"January"]
["This tab will put the date and time and location of the budget hearing on the Budget Summary page.  Also, provide the location where as the budget can be reveiwed.  Please input information in the green areas.",null,null,null,null,null,null,null,null,"February"]
[null,null,null,null,null,null,null,null,null,"March"]
["Official Name:","Patricia Stockham",null,null,null,null,null,null,null,"April"]
[null,null,null,null,null,null,null,null,null,"May"]
["Official Title:","Garden City Township Treasurer",null,null,null,null,null,null,null,"June"]
[null,null,null,null,null,null,null,null,null,"July"]
["Date:","July 25, 2012",null,"Must be at least 10 days between date published and hearing held.",null,null,null,null,null,"August"]
{"$rows_left_out":19}
{"sheet":"cert","index":4,"n_rows":59,"n_cols":8,"rows_kept":59,"cut":false,"hidden":false,"merged":[[53,4,53,6],[38,2,38,3],[39,2,39,3],[40,2,40,3],[0,1,0,6],[11,5,13,5],[10,4,10,6],[5,1,5,6],[6,1,6,6],[2,1,2,7],[7,1,7,6],[8,1,8,6],[4,1,4,6],[3,1,3,6]]}
[null,"CERTIFICATE",null,null,null,null,null,{"$f":"inputPrYr!D5","v":2013}]
[]
[null,{"$f":"CONCATENATE(\"To the Clerk of \",inputPrYr!D3,\", State of Kansas\")","v":"To the Clerk of Finney County, State of Kansas"}]
[null,"We, the undersigned, officers of"]
[null,{"$f":"inputPrYr!D2","v":"Garden City Township"}]
[null,"certify that:  (1) the hearing mentioned in the attached publication was held; "]
[null,"(2) after the Budget Hearing this budget was approved and adopted as the"]
[null,{"$f":"CONCATENATE(\"maximum expenditures for the various funds for the year \",H1,\"; and (3) the\")","v":"maximum expenditures for the various funds for the year 2013; and (3) the"}]
{"$rows_left_out":52}
{"sheet":"computation","index":5,"n_rows":37,"n_cols":10,"rows_kept":37,"cut":false,"hidden":false,"merged":[[35,0,35,9],[36,0,36,9],[2,0,2,9],[3,4,3,6]]}
[null,null,{"$f":"inputPrYr!D2","v":"Garden City Township"},null,null,null,null,null,null,{"$f":"inputPrYr!D5","v":2013}]
[]
[{"$f":"CONCATENATE(\"Computation to Determine Limit for \",J1,\"\")","v":"Computation to Determine Limit for 2013"}]
[null,null,null,null,null,null,null,null,null,"Amount of Levy"]
[" 1.",{"$f":"CONCATENATE(\"Total Tax Levy Amount in \",J1-1,\"\")","v":"Total Tax Levy Amount in 2012"},null,null,null,null,null,"+","$",{"$f":"inputPrYr!E26","v":77801}]
[" 2.",{"$f":"CONCATENATE(\"Debt Service Levy in \",J1-1,\"\")","v":"Debt Service Levy in 2012"},null,null,null,null,null,"-","$",{"$f":"inputPrYr!E17","v":0}]
[" 3.","Tax Levy Excluding Debt Service",null,null,null,null,null,null,"$",{"$f":"J5-J6","v":77801}]
[]
{"$rows_left_out":30}
{"sheet":"mvalloc","index":6,"n_rows":34,"n_cols":10,"rows_kept":34,"cut":false,"hidden":false,"merged":[[8,4,9,4],[8,6,8,9],[5,1,5,9]]}
[null,{"$f":"inputPrYr!D2","v":"Garden City Township"},null,null,null,null,null,null,null,{"$f":"inputPrYr!D5","v":2013}]
[null,{"$f":"inputPrYr!D3","v":"Finney County"}]
[]
[]
[]
[null,"Allocation of Motor, Recreational, and 16/20M Vehicle Tax "]
[]
[]
{"$rows_left_out":27}
{"sheet":"transfer","index":7,"n_rows":32,"n_cols":6,"rows_kept":32,"cut":false,"hidden":false,"merged":[[4,0,4,5]]}
[null,null,null,null,null,{"$f":"inputPrYr!D5","v":2013}]
[{"$f":"inputPrYr!D2","v":"Garden City Township"}]
[]
[]
["Schedule of Transfers"]
[]
["Expenditure","Receipt","Actual","Current","Proposed","Transfers"]
["Fund Transferred ","Fund Transferred","Amount for","Amount for","Amount for","Authorized by "]
{"$rows_left_out":25}
{"sheet":"TransferStatutes","index":8,"n_rows":33,"n_cols":1,"rows_kept":33,"cut":false,"hidden":false,"merged":[]}
["Transfers - Townships"]
[]
["K.S.A. 2-1318.  Transfer to noxious weed capital outlay fund.  Any moneys remaining in the noxious weed eradication fund at the end of any year for which a levy is made may be transferred to the noxious weed capital outlay fund."]
[]
[]
["K.S.A. 10-117a.  Transfer from debt service fund.  Whenever all bond issues have been completely retired the governing body may transfer to the general fund the unexpended balance in the debt service fund."]
[]
[]
{"$rows_left_out":26}
{"sheet":"debt-lease","index":9,"n_rows":38,"n_cols":12,"rows_kept":38,"cut":false,"hidden":false,"merged":[[17,1,17,8]]}
[null,{"$f":"inputPrYr!$D$2","v":"Garden City Township"},null,null,null,null,null,null,null,null,null,{"$f":"inputPrYr!D5","v":2013}]
[null,{"$f":"inputPrYr!$D$3","v":"Finney County"}]
[null,"STATEMENT OF INDEBTEDNESS"]
[]
[null,"Type","Date","Interest",null,"Amount",null,null,"   Amount Due",null,"   Amount Due"]
[null,"of","of","Rate","Amount","Outstanding","  Date Due",null,{"$f":"L1-1","v":2012},null,{"$f":"L1","v":2013}]
[null,"Debt","Issue","%","Issued",{"$f":"CONCATENATE(\"Jan 1,\",L1-1,\"\")","v":"Jan 1,2012"},"Interest","Principal","Interest","Principal","Interest","Principal"]
[null,"G.O. Bonds"]
{"$rows_left_out":31}
{"sheet":"Library Grant","index":10,"n_rows":105,"n_cols":7,"rows_kept":105,"cut":false,"hidden":false,"merged":[[42,1,42,8],[1,1,1,8],[2,1,2,8],[4,1,4,8],[9,1,9,8],[35,1,35,8]]}
[]
[null,"WORKSHEET FOR STATE GRANT-IN-AID TO PUBLIC LIBRARIES AND"]
[null,"REGIONAL LIBRARY SYSTEMS"]
[]
[null,{"$f":"CONCATENATE(\"Budgeted Year: \",inputPrYr!D5,\"\")","v":"Budgeted Year: 2013"}]
[]
[null,{"$f":"CONCATENATE(\"Library found in: \",inputPrYr!D2,\"\")","v":"Library found in: Garden City Township"}]
[null,{"$f":"inputPrYr!D3","v":"Finney County"}]
{"$rows_left_out":98}
{"sheet":"gen","index":11,"n_rows":73,"n_cols":17,"rows_kept":73,"cut":false,"hidden":false,"merged":[[57,6,57,9],[56,2,56,3],[52,2,52,3],[53,2,53,3],[40,6,40,9],[47,6,47,9]]}
[null,{"$f":"inputPrYr!D2","v":"Garden City Township"},null,null,{"$f":"inputPrYr!D5","v":2013}]
[]
[null,"FUND PAGE FOR FUNDS WITH A TAX LEVY"]
[null,"Adopted Budget","Prior Year","Current Year","Proposed Budget"]
[null,{"$f":"inputPrYr!B16","v":"General"},{"$f":"CONCATENATE(\"Actual for \",$E$1-2,\"\")","v":"Actual for 2011"},{"$f":"CONCATENATE(\"Estimate for \",$E$1-1,\"\")","v":"Estimate for 2012"},{"$f":"CONCATENATE(\"Year for \",$E$1,\"\")","v":"Year for 2013"}]
[null,"Unencumbered Cash Balance January 1",48515,{"$f":"C51","v":48439},{"$f":"D51","v":38239}]
[null,"Receipts:"]
[null,"Ad Valorem Tax",null,{"$f":"IF(inputPrYr!H15>0,inputPrYr!G16,inputPrYr!E16)","v":0},"x"]
{"$rows_left_out":66}
{"sheet":"DebtSvs-Library","index":12,"n_rows":96,"n_cols":11,"rows_kept":96,"cut":false,"hidden":false,"merged":[[23,6,23,9],[30,6,30,9],[35,2,35,3],[36,2,36,3],[39,2,39,3],[76,2,76,3],[79,2,79,3],[80,2,80,3],[80,6,80,9],[40,2,40,3],[40,6,40,9],[63,6,63,9],[70,6,70,9],[75,2,75,3]]}
[null,{"$f":"inputPrYr!D2","v":"Garden City Township"},null,null,{"$f":"inputPrYr!D5","v":2013}]
[]
[null,"FUND PAGE FOR FUNDS WITH A TAX LEVY"]
[null,"Adopted Budget","Prior Year ","Current Year ","Proposed Budget "]
[null,{"$f":"inputPrYr!B17","v":"Debt Service"},{"$f":"CONCATENATE(\"Actual for \",$E$1-2,\"\")","v":"Actual for 2011"},{"$f":"CONCATENATE(\"Estimate for \",$E$1-1,\"\")","v":"Estimate for 2012"},{"$f":"CONCATENATE(\"Year for \",$E$1,\"\")","v":"Year for 2013"}]
[null,"Unencumbered Cash Balance Jan 1",null,{"$f":"C34","v":0},{"$f":"D34","v":0}]
[null,"Receipts:"]
[null,"Ad Valorem Tax",null,{"$f":"IF(inputPrYr!H15>0,inputPrYr!G19,inputPrYr!E19)","v":0},"x"]
{"$rows_left_out":89}
{"sheet":"road","index":13,"n_rows":75,"n_cols":11,"rows_kept":75,"cut":false,"hidden":false,"merged":[[49,2,49,3],[45,2,45,3],[46,2,46,3],[57,3,58,4],[33,6,33,9],[40,6,40,9],[50,6,50,9]]}
[null,{"$f":"inputPrYr!D2","v":"Garden City Township"},null,null,{"$f":"inputPrYr!D5","v":2013}]
[]
[null,"FUND PAGE FOR FUNDS WITH A TAX LEVY"]
[null,"Adopted Budget","Prior Year","Current Year","Proposed Budget"]
[null,{"$f":"inputPrYr!B19","v":"Road"},{"$f":"gen!C5","v":"Actual for 2011"},{"$f":"gen!D5","v":"Estimate for 2012"},{"$f":"gen!E5","v":"Year for 2013"}]
[null,"Unencumbered Cash Balance January 1",null,{"$f":"C44","v":0},{"$f":"D44","v":0}]
[null,"Receipts:"]
[null,"Ad Valorem Tax",null,{"$f":"IF(inputPrYr!H15>0,inputPrYr!G19,inputPrYr!E19)","v":0},"x"]
{"$rows_left_out":68}
{"sheet":"levypage9","index":14,"n_rows":95,"n_cols":11,"rows_kept":95,"cut":false,"hidden":false,"merged":[[23,6,23,9],[30,6,30,9],[40,6,40,9],[63,6,63,9],[70,6,70,9],[80,6,80,9],[79,2,79,3],[39,2,39,3],[35,2,35,3],[36,2,36,3],[75,2,75,3],[76,2,76,3]]}
[null,{"$f":"inputPrYr!D2","v":"Garden City Township"},"        ",null,{"$f":"inputPrYr!D5","v":2013}]
[]
[null,"FUND PAGE FOR FUNDS WITH A TAX LEVY"]
[null,"Adopted Budget","Prior Year","Current Year","Proposed Budget"]
[null,{"$f":"inputPrYr!B20","v":"Fire"},{"$f":"gen!C5","v":"Actual for 2011"},{"$f":"gen!D5","v":"Estimate for 2012"},{"$f":"gen!E5","v":"Year for 2013"}]
[null,"Unencumbered Cash Balance January 1",91897,{"$f":"C34","v":91901},{"$f":"D34","v":81080}]
[null,"Receipts:"]
[null,"Ad Valorem Tax",86188,{"$f":"IF(inputPrYr!H15>0,inputPrYr!G20,inputPrYr!E20)","v":77801},"x"]
{"$rows_left_out":88}
{"sheet":"levypage10","index":15,"n_rows":95,"n_cols":11,"rows_kept":95,"cut":false,"hidden":false,"merged":[[23,6,23,9],[30,6,30,9],[40,6,40,9],[63,6,63,9],[70,6,70,9],[80,6,80,9],[79,2,79,3],[39,2,39,3],[35,2,35,3],[36,2,36,3],[75,2,75,3],[76,2,76,3]]}
[null,{"$f":"inputPrYr!D2","v":"Garden City Township"},null,null,{"$f":"inputPrYr!D5","v":2013}]
[]
[null,"FUND PAGE FOR FUNDS WITH A TAX LEVY"]
[null,"Adopted Budget","Prior Year","Current Year","Proposed Budget"]
[null,{"$f":"inputPrYr!B22","v":0},{"$f":"gen!C5","v":"Actual for 2011"},{"$f":"gen!D5","v":"Estimate for 2012"},{"$f":"gen!E5","v":"Year for 2013"}]
[null,"Unencumbered Cash Balance January 1",null,{"$f":"C34","v":0},{"$f":"D34","v":0}]
[null,"Receipts:"]
[null,"Ad Valorem Tax",null,{"$f":"IF(inputPrYr!H15>0,inputPrYr!G22,inputPrYr!E22)","v":0},"x"]
{"$rows_left_out":88}
{"sheet":"levypage11","index":16,"n_rows":95,"n_cols":11,"rows_kept":95,"cut":false,"hidden":false,"merged":[[23,6,23,9],[30,6,30,9],[40,6,40,9],[63,6,63,9],[70,6,70,9],[35,2,35,3],[36,2,36,3],[80,6,80,9],[79,2,79,3],[39,2,39,3],[75,2,75,3],[76,2,76,3]]}
[null,{"$f":"inputPrYr!D2","v":"Garden City Township"},null,null,{"$f":"inputPrYr!D5","v":2013}]
[]
[null,"FUND PAGE FOR FUNDS WITH A TAX LEVY"]
[null,"Adopted Budget","Prior Year","Current Year","Proposed Budget"]
[null,{"$f":"inputPrYr!B24","v":0},{"$f":"gen!C5","v":"Actual for 2011"},{"$f":"gen!D5","v":"Estimate for 2012"},{"$f":"gen!E5","v":"Year for 2013"}]
[null,"Unencumbered Cash Balance January 1",null,{"$f":"C34","v":0},{"$f":"D34","v":0}]
[null,"Receipts:"]
[null,"Ad Valorem Tax",null,{"$f":"IF(inputPrYr!H15>0,inputPrYr!G24,inputPrYr!E24)","v":0},"x"]
{"$rows_left_out":88}
{"sheet":"nolevypage12","index":17,"n_rows":65,"n_cols":5,"rows_kept":65,"cut":false,"hidden":false,"merged":[]}
[null,{"$f":"inputPrYr!D2","v":"Garden City Township"},null,null,{"$f":"inputPrYr!D5","v":2013}]
[]
[null,"FUND PAGE FOR FUNDS WITH NO TAX LEVY"]
[null,"Adopted Budget","Prior Year","Current Year","Proposed Budget"]
[null,{"$f":"inputPrYr!B29","v":0},{"$f":"gen!C5","v":"Actual for 2011"},{"$f":"gen!D5","v":"Estimate for 2012"},{"$f":"gen!E5","v":"Year for 2013"}]
[null,"Unencumbered Cash Balance Jan 1",null,{"$f":"C29","v":0},{"$f":"D29","v":0}]
[null,"Receipts:"]
[]
{"$rows_left_out":58}
{"sheet":"nonbud","index":18,"n_rows":33,"n_cols":12,"rows_kept":33,"cut":false,"hidden":false,"merged":[[4,0,4,1],[4,2,4,3],[4,4,4,5],[4,6,4,7],[4,8,4,9]]}
[{"$f":"inputPrYr!$D$2","v":"Garden City Township"},null,null,null,null,"NON-BUDGETED FUNDS ",null,null,null,null,{"$f":"inputPrYr!$D$5","v":2013}]
[null,null,null,null,null,{"$f":"CONCATENATE(\"(Only the actual budget year for \",K1-2,\" is to be shown)\")","v":"(Only the actual budget year for 2011 is to be shown)"}]
["Non-Budgeted Funds"]
["(1) Fund Name:",null,"(2) Fund Name:",null,"(3) Fund Name:",null,"(4) Fund Name:",null,"(5) Fund Name:"]
[{"$f":"inputPrYr!B34","v":0},null,{"$f":"inputPrYr!B35","v":0},null,{"$f":"inputPrYr!B36","v":0},null,{"$f":"inputPrYr!B37","v":0},null,{"$f":"inputPrYr!B38","v":0}]
["Unencumbered ",null,"Unencumbered ",null,"Unencumbered ",null,"Unencumbered ",null,"Unencumbered ",null,"Total"]
["Cash Balance Jan 1",null,"Cash Balance Jan 1",null,"Cash Balance Jan 1",null,"Cash Balance Jan 1",null,"Cash Balance Jan 1",null,{"$f":"SUM(B7+D7+F7+H7+J7)","v":0}]
["Receipts:",null,"Receipts:",null,"Receipts:",null,"Receipts:",null,"Receipts:"]
{"$rows_left_out":26}
{"sheet":"NonBudFunds","index":19,"n_rows":25,"n_cols":1,"rows_kept":25,"cut":false,"hidden":false,"merged":[]}
["Non-Budgeted Funds - Townships"]
["K.S.A. 12-110d.  Special ambulance or emergency medical service equipment fund.  The governing body may create a special reserve fund for replacement of ambulance or emergency medical service equipment."]
[]
["K.S.A. 12-631p.  Sewerage system reserve fund.  The governing body may create a sewer system reserve fund for the future maintenance and operation of its system and for the construction of improvements and expansions to such system."]
[]
["K.S.A. 12-1663.  Federal grants (e.g. FEMA).  Federal aid intended to be used alone or with funds of the public agency may be expended without regard to budget limitations and over, above or outside the budget."]
[]
["K.S.A. 12-16,102.  Employee benefits trust funds.  For the purpose of holding and investing the assets of other postemployment benefits funds any taxing subdivision may establish one or more trust funds."]
{"$rows_left_out":18}
{"sheet":"summ","index":20,"n_rows":38,"n_cols":14,"rows_kept":38,"cut":false,"hidden":false,"merged":[[1,1,1,8],[35,1,35,2],[34,1,34,2],[21,10,21,13],[27,10,27,13],[18,10,18,13],[2,1,2,8],[12,7,14,7],[5,1,5,8],[4,1,4,8],[3,1,3,8]]}
[null,"Published in the Garden City Telegram July 14, 2012",null,null,null,null,null,null,{"$f":"inputPrYr!D5","v":2013}]
[null,"NOTICE OF BUDGET HEARING"]
[null,"The governing body of"]
[null,{"$f":"inputPrYr!D2","v":"Garden City Township"}]
[null,{"$f":"inputPrYr!D3","v":"Finney County"}]
[null,{"$f":"CONCATENATE(\"will meet on \",inputBudSum!B8,\" at \",inputBudSum!B10,\" at \",inputBudSum!B12,\" for the purpose of hearing and\")","v":"will meet on July 25, 2012 at 10:30 a.m. at 2005 E. 6 Mile Road for the purpose of hearing and"}]
[null,"answering objections of taxpayers relating to the proposed use of all funds and the amount of ad valorem tax."]
[null,{"$f":"CONCATENATE(\"Detailed budget information is available at \",inputBudSum!B15,\" and will be available at this hearing.\")","v":"Detailed budget information is available at Finney County Clerk's office and will be available at this hearing."}]
{"$rows_left_out":31}
{"sheet":"nhood","index":21,"n_rows":38,"n_cols":6,"rows_kept":38,"cut":false,"hidden":false,"merged":[[24,1,24,2],[2,1,2,4],[18,0,18,2],[20,1,20,2],[22,0,22,2]]}
[{"$f":"inputPrYr!D2","v":"Garden City Township"},null,null,null,null,{"$f":"inputPrYr!D5","v":2013}]
[]
[null,{"$f":"CONCATENATE(\"\",F1,\" Neighborhood Revitalization Rebate\")","v":"2013 Neighborhood Revitalization Rebate"}]
[]
[null,{"$f":"CONCATENATE(\"Budgeted Funds                            for \",F1,\"\")","v":"Budgeted Funds                            for 2013"},{"$f":"CONCATENATE(\"\",F1-1,\" Ad Valorem before Rebate**\")","v":"2012 Ad Valorem before Rebate**"},{"$f":"CONCATENATE(\"\",F1-1,\" Mil Rate before Rebate\")","v":"2012 Mil Rate before Rebate"},{"$f":"CONCATENATE(\"Estimate \",F1,\" NR Rebate\")","v":"Estimate 2013 NR Rebate"}]
[null,{"$f":"inputPrYr!B16","v":"General"},null,{"$f":"IF(C6>0,C6/$D$21,\"\")","v":""},{"$f":"IF(C6>0,ROUND(D6*$D$25,0),\"\")","v":""}]
[null,{"$f":"inputPrYr!B17","v":"Debt Service"},null,"",""]
[null,{"$f":"inputPrYr!B18","v":"Library"},null,{"$f":"IF(C8>0,C8/$D$21,\"\")","v":""},{"$f":"IF(C8>0,ROUND(D8*$D$25,0),\"\")","v":""}]
{"$rows_left_out":31}
{"sheet":"Resolution","index":22,"n_rows":36,"n_cols":9,"rows_kept":36,"cut":false,"hidden":false,"merged":[[1,0,1,6],[2,0,2,6],[4,0,5,6],[27,3,27,6],[25,3,25,6],[15,0,16,6],[18,0,20,6],[23,3,23,6],[24,3,24,6],[21,0,22,6],[28,3,28,6],[30,3,30,6],[31,3,31,6],[13,0,14,6],[8,0,9,6],[10,0,12,6]]}
["Published in the Garden City Telegram July 14, 2012"]
["TOWNSHIP RESOLUTION"]
["RESOLUTION NO.1-2012"]
[{"$f":"CONCATENATE(\"A resolution expressing the property taxation policy of the Board of \",(inputPrYr!D2),\" \")","v":"A resolution expressing the property taxation policy of the Board of Garden City Township "},null,null,null,null,null,null,null,{"$f":"CONCATENATE(I5)","v":""}]
[{"$f":"CONCATENATE(\"   with respect to financing the \",inputPrYr!D5,\" annual budget for \",(inputPrYr!D2),\" , \",(inputPrYr!D3),\" , Kansas.\")","v":"   with respect to financing the 2013 annual budget for Garden City Township , Finney County , Kansas."}]
[]
["Whereas, K.S.A. 79-2925b provides that a resolution be adopted if property taxes levied"]
[{"$f":"CONCATENATE(\"to finance the \",inputPrYr!D5,\" \",(inputPrYr!D2),\" budget exceed the amount levied to finance the \",inputPrYr!D5-1,\"\")","v":"to finance the 2013 Garden City Township budget exceed the amount levied to finance the 2012"}]
{"$rows_left_out":29}
{"sheet":"Tab A","index":23,"n_rows":85,"n_cols":1,"rows_kept":85,"cut":false,"hidden":false,"merged":[]}
[]
[]
["Possible Budget Law Violation"]
[]
["Welcome.  You have been directed to this tab because your "]
[{"$f":"CONCATENATE(inputPrYr!D5-2,\" 'total expenditures' exceed your \",inputPrYr!D5-2,\" 'budget authority.'\")","v":"2011 'total expenditures' exceed your 2011 'budget authority.'"}]
[]
["In short, you are looking at a potential budget law violation."]
{"$rows_left_out":78}
{"sheet":"Tab B","index":24,"n_rows":79,"n_cols":1,"rows_kept":79,"cut":false,"hidden":false,"merged":[]}
[]
[]
["Possible Cash Basis Law Violation"]
[]
["Welcome.  You have been directed to this tab because your"]
[{"$f":"CONCATENATE(inputPrYr!D5-2,\" expenditures show that you finished the year with a \")","v":"2011 expenditures show that you finished the year with a "}]
["negative unencumbered cash balance in this fund."]
[]
{"$rows_left_out":72}
{"sheet":"Tab C","index":25,"n_rows":75,"n_cols":1,"rows_kept":75,"cut":false,"hidden":false,"merged":[]}
[]
[]
["Current Year - Possible Budget Law Violation"]
[]
["Welcome.  You have been directed to this tab because your "]
[{"$f":"CONCATENATE(\"estimated \",inputPrYr!D5-1,\" 'total expenditures' exceed your \",inputPrYr!D5-1,\"\")","v":"estimated 2012 'total expenditures' exceed your 2012"}]
["budget authority.'"]
[]
{"$rows_left_out":68}
{"sheet":"Tab D","index":26,"n_rows":72,"n_cols":1,"rows_kept":72,"cut":false,"hidden":false,"merged":[]}
[]
[]
["Current Year - Possible Cash Basis Law Violation"]
[]
["Welcome.  You have been directed to this tab because your"]
[{"$f":"CONCATENATE(inputPrYr!D5,\" estimated expenditures show that at the end of this year\")","v":"2013 estimated expenditures show that at the end of this year"}]
["you will have a negative unencumbered cash balance in this"]
["fund."]
{"$rows_left_out":65}
{"sheet":"Tab E","index":27,"n_rows":52,"n_cols":1,"rows_kept":52,"cut":false,"hidden":false,"merged":[]}
[]
[]
["Proposed Budget Year - Possible Budget Law Violation"]
["No Levy Funds"]
[]
[]
["Welcome.  You have been directed to this tab because your "]
[{"$f":"CONCATENATE(\"estimated \",inputPrYr!D5,\" 'total expenditures' exceed your \",inputPrYr!D5,\"\")","v":"estimated 2013 'total expenditures' exceed your 2013"}]
{"$rows_left_out":45}
{"sheet":"Mill Rate Computation","index":28,"n_rows":148,"n_cols":10,"rows_kept":148,"cut":false,"hidden":false,"merged":[[147,2,147,3],[147,9,147,10],[127,1,127,10],[129,1,129,10],[132,2,132,3],[132,7,132,8],[133,2,133,3],[133,7,133,8],[135,2,135,3],[136,2,136,3],[143,1,143,10],[146,2,146,3],[146,9,146,10],[125,1,125,10],[99,2,99,3],[102,2,102,3],[104,1,104,10],[105,1,105,10],[107,1,107,10],[109,1,109,10],[113,2,113,3],[116,2,116,3],[119,2,119,3],[122,2,122,3],[124,1,124,10],[96,2,96,3],[56,1,56,10],[57,1,57,10],[73,2,73,3],[76,2,76,3],[79,2,79,3],[82,2,82,3],[84,1,84,10],[85,1,85,10],[87,1,87,10],[89,1,89,10],[93,2,93,3],[54,1,54,10],[24,2,24,3],[29,1,29,10],[30,1,30,10],[32,1,32,10],[34,1,34,10],[40,2,40,3],[47,1,47,2],[49,6,49,7],[50,8,50,10],[51,1,51,10],[52,1,52,10],[22,5,22,6],[5,1,5,10],[6,1,6,10],[7,1,7,10],[9,1,9,10],[11,1,11,10]]}
[]
[]
[]
[]
[]
[null,"How To Compute The Value of One Mill, And The Impact Of Tax Dollars And Assessed Valuation On Mill Rates"]
[null,"* * * * *"]
[null,"To Compute the Value of One Mill"]
{"$rows_left_out":141}
{"sheet":"Helpful Links","index":29,"n_rows":40,"n_cols":1,"rows_kept":40,"cut":false,"hidden":false,"merged":[]}
["Helpful Links"]
[]
["Municipal Services (Kansas Department of Administration, Accounts and Reports) – Budget forms, confirmation of payments, transfer statutes, non-budgeted fund statutes, etc."]
["http://www.da.ks.gov/ar/muniserv/"]
[]
[]
["State Debt Setoff Program (Kansas Department of Administration, Accounts and Reports) – Passive collection tool to assist municipalities with collection of unpaid utility bills, etc."]
["http://www.da.ks.gov/ar/setoff/"]
{"$rows_left_out":33}
{"sheet":"legend","index":30,"n_rows":187,"n_cols":1,"rows_kept":187,"cut":false,"hidden":false,"merged":[]}
["The following were changed to this spreadsheet on 2/2/12"]
["1. Instruction tab - line A7 add Library "]
["2. Instruction tab - add line #1c for ad valorem adjustments"]
["3. Instruction tab - add line #3b to indicate latest date for printing"]
["4. Instruction tab - add line #10 to explain about Library Grant Tab"]
["5. Instruction tab - add line #11a concerning changing the general fund page number due to library grant page"]
["6. Instruction tab - changed 11b, c, and d for new fund tables on fund pages, and 13b, c, and d for tables on Summary"]
["7. InputPrYr tab - add Library to the fund page list"]
{"$rows_left_out":180}
{"sheet":"SignCert","index":31,"n_rows":0,"n_cols":0,"rows_kept":0,"cut":false,"hidden":false,"merged":[]}

{"sheet":"Publication","index":32,"n_rows":0,"n_cols":0,"rows_kept":0,"cut":false,"hidden":false,"merged":[]}